{"text_format":"1","workbook":"xlsx","n_sheets":6,"sheets":["Loan Calculator","Workings","Heads of Terms","Aff. Calculator","Summary Matrix","ONS Figures"],"not_rendered":{"charts":0,"images":3,"macros":1,"external_links":4,"defined_names":70,"comments":2,"pivot_tables":0},"unopened":[],"bounds":{"document_bytes":16777216,"sheet_cells":100000,"rows_first":2000,"rows_last":500,"rows_between":2000,"halvings":0,"cell_chars":16384,"cell_head_chars":4096},"cells_cut":0,"cells_raw":0,"read":"whole","date_system":"1900"}

{"sheet":"Loan Calculator","index":0,"n_rows":60,"n_cols":16,"rows_kept":60,"cut":false,"hidden":false,"merged":[[56,12,56,15],[54,2,54,3],[30,7,30,10],[48,7,48,10],[62,2,62,5],[56,2,56,3],[36,2,36,5],[39,2,39,3],[42,7,45,10],[57,2,57,3],[55,2,55,3],[32,2,32,3],[38,2,38,3],[44,2,44,3],[38,12,52,15],[52,2,52,3],[18,12,18,13],[24,12,24,13],[25,2,25,3],[4,2,4,15],[10,12,10,15],[12,12,12,13],[16,3,16,5],[13,3,13,5],[14,12,14,13],[10,7,10,10],[10,2,10,5],[7,13,7,14],[14,3,14,5],[15,3,15,5],[12,3,12,5],[17,3,17,5],[22,12,22,14],[50,2,50,3],[46,2,46,3],[48,2,48,3],[28,12,28,15],[28,2,28,3],[40,2,40,3],[49,2,49,3],[27,2,27,3],[42,2,42,3],[2,6,3,11],[6,13,6,14],[6,4,6,10],[7,4,7,10],[16,12,16,13],[3,3,3,4]]}
[]
[]
[null,null,null,null,null,null,"NON-REGULATED BRIDGE CALCULATOR"]
[]
[null,null,"Effective from 12th June 2025"]
[]
[null,null,null,"Name",null,null,null,null,null,null,null,null,"Exit:"]
[null,null,null,"Security Address",null,null,null,null,null,null,null,null,"Purpose:"]
[]
[]
[null,null,"Proposed Loan (Inputs in blue)",null,null,null,null,"Loan Outputs",null,null,null,null,{"$f":"\"Rental Calculations\"&IF(Workings!$B$34=1,\" (Not Required for HOBL)\",\"\")","v":"Rental Calculations"}]
[]
[null,null,"Security","First Charge - Purchase",null,null,null,"Net Loan",null,null,{"$f":"IFERROR(IF(F21<Workings!B24,\"Below Min\",IF(F21>Workings!B23,\"Above Max\",IF(ISERROR(VLOOKUP(Workings!B15,Workings!A84:H149,5,FALSE)),\"No Plan\",F21))),\"\")","v":350000},null,"Max MT CMI on rent",null,null,{"$f":"IFERROR(IF(F33=\"Serviced\",IF(P17<=(F45/Workings!B18),((F45/Workings!B18)-F55),\"Fails Rental\"),\"Rolled\"),\"\")","v":"Rolled"}]
[]
[null,null,"Loan Plan","BTL / Holiday Let Bridge",null,null,null,{"$f":"\"Lender Fee\"&IF(F27>0,\" (inc Title Insurance)\",\"\")","v":"Lender Fee (inc Title Insurance)"},null,null,{"$f":"IF(D25=\"Added\",F25+Workings!I19,0)","v":11499},null,"MT proposed CMI",null,null,{"$f":"IF(F33=\"Serviced\",SUM(K21),\"Rolled\")","v":"Rolled"}]
[]
[null,null,"Rate Type","Fixed for Term",null,null,null,"Broker Fee",null,null,{"$f":"IF(OR(F23>F21*10%,F23>10000),\"Too High\",IF(D23=\"Added\",F23,0))","v":0},null,"Total Secured CMIs",null,null,{"$f":"IF(F33=\"Serviced\",IF(AND(Workings!B16=\"First charge\",F55>0),\"Remove RED\",SUM(F55+P15)),\"Rolled\")","v":"Rolled"}]
[]
[null,null,"Status Points",0,null,"Packaged",null,"Gross Loan",null,null,{"$f":"SUM(K17,K15,K13)","v":361499},null,"DSCR",null,null,{"$f":"IF(F33=\"Serviced\",IFERROR(SUM(F45/P17),\"\"),\"Rolled\")","v":"Rolled"}]
[]
[null,null,"Net Loan",null,null,350000,null,{"$f":"IF(F33=\"Serviced\",\"Monthly Payment\",\"Month 1 Interest (approx)\")","v":"Month 1 Interest (approx)"},null,null,{"$f":"IF(F29=\"\",\"Add Term\",IFERROR(ROUND((K19*Workings!B29),IF(F33=\"serviced\",2,0)),\"\"))","v":3651},null,"Stressed Shortfall?",null,null,{"$f":"IF(F33=\"Serviced\",IFERROR(IF((P23*DSCR)-F45<0,\"Fits Rent\", SUM((P23*DSCR)-F45)),\"\"),\"Rolled\")","v":"Rolled"}]
[]
[null,null,"Broker fee","Added",null,null,null,{"$f":"IF(F33=\"Serviced\",\"Monthly Payment (Stressed)\",\"Interest Over Term (approx)\")","v":"Interest Over Term (approx)"},null,null,{"$f":"IF(F29=\"\",\"Add Term\",IFERROR(IF(F33=\"Serviced\",IF(RIGHT(D15,5)=\"fixed\",IFERROR(ROUND(K19*Workings!B29,2),\"\"),IFERROR(ROUND(K19*(Workings!B29+(Stress/12)),2),\"\")),ROUNDUP(K19*((1+Workings!B29)^F29)-K19,0)),\"\"))","v":46332},null,"Total Secured CMIs Stressed",null,null,{"$f":"IF(F33=\"Serviced\",IFERROR(K23+F57,\"\"),\"Rolled\")","v":"Rolled"}]
[]
[null,null,"Lender Fee","Added",null,{"$f":"IFERROR(ROUND((Workings!B32*F21)+Workings!B33,2),0)","v":10500},null,{"$f":"IF(F33=\"Serviced\",\"Total Interest\",\"Total Loan (approx inc Interest)\")","v":"Total Loan (approx inc Interest)"},null,null,{"$f":"IFERROR(IF(F33=\"Serviced\",IFERROR(K21*F29,\"\"),K19+K23),\"\")","v":407831},null,"DSCR Stressed (1%)",null,null,{"$f":"IF(F33=\"Serviced\",IFERROR(SUM(F45/(F57+K23)),\"\"),\"Rolled\")","v":"Rolled"}]
[]
[null,null,{"$f":"IF(LEFT(D13,1)=\"S\",\"\",\nIF(LEFT(F41,1)=\"N\",\"\",\nIF(Workings!I23=\"NO\",\"\",\n\"Title Insurance\")))","v":"Title Insurance"},"Yes",null,{"$f":"Workings!I19","v":999},null,"LTV",null,null,{"$f":"IFERROR(IF(AND(Workings!B16=\"First charge\",F53>0),\"Remove RED\",IF(OR(Workings!B13=\"Y\",Workings!B14=\"Y\"),\"Add First charge\",ROUNDUP(SUM(IF(F33=\"Serviced\",K19,K25),F53)/F39,3))),\"\")","v":0.81599999999999995}]
[]
[null,null,"Term in Months",null,null,12,null,null,null,null,null,null,"Maximum Loan Calculator"]
[]
{"$rows_left_out":31}
{"sheet":"Workings","index":1,"n_rows":186,"n_cols":15,"rows_kept":186,"cut":false,"hidden":true,"merged":[]}
["Drop Downs"]
[]
["Fee Type","Location","Rate Type","Plan","Prop Type","Plan LTV","Status Points","Service Type","Security",null,"1st Type","1st rate","Purpose","Broker Fee Type","Term"]
["Added","England",{"$f":"IF(LEFT('Loan Calculator'!D15,7)=\"Express\",\"\",\"Variable\")","v":"Variable"},null,"Ex C'cil Flat / Mais",0.75,0,"Rolled","First Charge - Purchase","Yes","Repayment","Variable","Purchase","Percentage",1]
["Up-Front","Wales","Fixed for Term","BTL / Holiday Let Bridge","Freehold Flat",0.7,1,"Serviced","First Charge - Other","No","Interest Only","Fixed <5yr","Refurbishment","Amount",2]
[null,{"$f":"IF(LEFT('Loan Calculator'!D15,7)=\"Express\",\"\",\"Mainland Scotland\")","v":"Mainland Scotland"},null,"Equitable Charge Bridge","Other",0.6,2,null,"Second Charge",null,null,"Fixed >5yr","Consolidation",null,3]
[null,{"$f":"IF(LEFT('Loan Calculator'!D15,7)=\"Express\",\"\",\"Northern Ireland\")","v":"Northern Ireland"},null,{"$f":"IF(B14=\"First charge\",\"\",\"HO Business Loan\")","v":"HO Business Loan"},null,null,null,null,null,null,null,null,"Business",null,4]
[null,null,null,null,null,null,null,null,null,null,null,null,"Lease extension",null,5]
[null,null,null,null,null,null,null,null,null,null,null,null,"Other",null,6]
["Other calculated",null,null,null,null,null,null,null,null,null,null,null,null,null,7]
[null,null,null,null,null,null,null,null,null,null,null,null,null,null,8]
["Size",{"$f":"IF('Loan Calculator'!F21>Workings!B23,\"TOO HIGH\",\"OK\")","v":"OK"},null,null,null,null,null,null,null,null,null,null,null,null,9]
["2nd Ch bal",{"$f":"IF(AND(B16=\"Second charge\",'Loan Calculator'!F53=0),\"Y\",\"OK\")","v":"OK"},null,null,null,null,null,null,null,null,null,null,null,null,10]
["2nd Ch CMI",{"$f":"IF(AND(B16=\"Second charge\",'Loan Calculator'!F55=0),\"Y\",\"OK\")","v":"OK"},null,null,null,null,null,"Title Insurance ",null,null,null,null,null,null,11]
["Plan Code",{"$f":"B16&\" \"&'Loan Calculator'!D19 &\" SP\"","v":"First Charge 0 SP"},null,null,null,null,null,"%",2E-3,null,null,null,null,null,12]
["First / Second",{"$f":"IFERROR(LEFT('Loan Calculator'!D13,FIND(\"-\",'Loan Calculator'!D13)-2),'Loan Calculator'!D13)","v":"First Charge"},null,null,null,null,null,"Min",495,null,null,null,null,null,13]
["Stress Test pa",0.01,null,null,null,null,null,"IPT",0.12,null,null,null,null,null,14]
["Max DSCR",{"$f":"B19","v":1.25},null,null,null,null,null,"Gross for TI",{"$f":"'Loan Calculator'!F21+IF('Loan Calculator'!D25=\"Added\",'Loan Calculator'!F25,0)+IF('Loan Calculator'!D23=\"Added\",'Loan Calculator'!F23,0)","v":360500},null,null,null,null,null,15]
["DSCR BTL",1.25,null,null,null,null,null,"This Loan",{"$f":"IF('Loan Calculator'!D27=\"NO\",0,\nIF(I23=\"NO\",0,\nIF(I20=\"NORTHERN IRELAND\",0,\nIF(I24=\"SECOND CHARGE\",0,\nIF('Loan Calculator'!F21>300000,999,699)))))","v":999},null,null,null,null,null,16]
["DSCR Comm",1.4,"Max Loan (net)",null,null,null,null,"Property Location",{"$f":"'Loan Calculator'!F41","v":"England"},null,null,null,null,null,17]
[null,null,"Plan","Equitable charge","Express","NI",null,"Security",{"$f":"RIGHT('Loan Calculator'!D13,8)","v":"Purchase"},null,null,null,null,null,18]
[null,null,{"$f":"VLOOKUP(B15,A84:H149,5,FALSE)","v":500000},{"$f":"IF(LEFT('Loan Calculator'!D15,5)=\"Equit\",100000,C22)","v":500000},{"$f":"IF(AND('Loan Calculator'!D13=\"First Charge - Other\",B28=TRUE),1000000,C22)","v":500000},{"$f":"IF(LEFT('Loan Calculator'!F41,3)=\"Nor\",150000,C22)","v":500000},null,"Loan Value",{"$f":"'Loan Calculator'!F21","v":350000}]
["Max Loan all",{"$f":"MIN(C22:F22)","v":500000},{"$f":"IF(C22=MIN(C22:F22),1,\"\")","v":1},{"$f":"IF(D22<$C$22,1,\"\")","v":""},{"$f":"IF(E22<$C$22,1,\"\")","v":""},"",null,null,{"$f":"IF(AND(I21<>\"Purchase\",I22<=100000),\"NO\",\"YES\")","v":"YES"}]
["min loan",{"$f":"VLOOKUP(B15,A84:H149,4,FALSE)","v":25000},null,null,null,null,null,"Security",{"$f":"'Loan Calculator'!D13","v":"First Charge - Purchase"}]
["NI Max LTV",0.7]
["Overall Max LTV",0.75]
[]
["Express",{"$f":"'Loan Calculator'!C60","v":false}]
["Plan Rate",{"$f":"IFERROR(VLOOKUP(Workings!B15,Workings!A84:H149,IF(LEFT('Loan Calculator'!D17,5)=\"Fixed\",8,7),FALSE),\"No Plan\")","v":1.01E-2},null,null,null,null,"Fees","%","£"]
[null,null,null,null,null,null,"Normal",0.03]
{"$rows_left_out":157}
{"sheet":"Heads of Terms","index":2,"n_rows":95,"n_cols":3,"rows_kept":95,"cut":false,"hidden":false,"merged":[[89,1,89,2],[94,1,94,2],[90,1,90,2],[91,1,91,2],[93,1,93,2],[92,1,92,2],[84,1,84,2],[85,1,85,2],[86,1,86,2],[87,1,87,2],[88,1,88,2],[83,1,83,2],[73,1,73,2],[74,1,74,2],[75,1,75,2],[76,1,76,2],[77,1,77,2],[78,1,78,2],[79,1,79,2],[80,1,80,2],[81,1,81,2],[82,1,82,2],[72,1,72,2],[61,1,61,2],[62,1,62,2],[63,1,63,2],[64,1,64,2],[65,1,65,2],[66,1,66,2],[68,1,68,2],[69,1,69,2],[70,1,70,2],[71,1,71,2],[67,1,67,2],[30,1,30,2],[7,1,7,2],[9,1,9,2],[50,1,50,2],[12,1,12,2],[13,1,14,1],[13,2,14,2],[16,1,17,1],[16,2,17,2],[19,1,19,2],[60,1,60,2],[52,1,52,2],[53,1,53,2],[54,1,54,2],[55,1,55,2],[56,1,56,2],[57,1,57,2],[58,1,58,2],[59,1,59,2]]}
[]
[]
[null,{"$f":"\"Date: \"&IF('Loan Calculator'!D4=\"\",\"\",DAY('Loan Calculator'!D4)&\"/\"&MONTH('Loan Calculator'!D4)&\"/\"&YEAR('Loan Calculator'!D4))","v":"Date: "}]
[null,"Our Ref:  "]
[]
[null,"Introducer Name:"]
[]
[null,"Heads of Terms"]
[]
[null,"Thank you for your enquiry.  We are pleased to confirm that based on the information provided to us, the application is acceptable in principle and this outlines the facility that we may be able to provide together with some of the terms and conditions that will apply."]
[]
[null,"Applicant Name:  ",{"$f":"IF('Loan Calculator'!E7=\"\",\"\",'Loan Calculator'!E7)","v":""}]
[null,"If the application is being made by a Limited Company, please note that all directors/shareholders in the business will need to provide a personal guarantee. Also a debenture over the property."]
[null,"Security Address:",{"$f":"IF('Loan Calculator'!E8=\"\",\"\",'Loan Calculator'!E8)","v":""}]
[]
[null,"Advised Estimated Valuation of:",{"$f":"IF('Loan Calculator'!F39=\"\",\"\",'Loan Calculator'!F39)","v":500000}]
[null,"Other Security Address: "]
[]
[null,"Advised Estimated Valuation of:","£"]
[]
[null,"Product:",{"$f":"'Loan Calculator'!D15 & \" - Bridge - \"& 'Loan Calculator'!D19&\"SP\"","v":"BTL / Holiday Let Bridge - Bridge - 0SP"}]
[null,"Loan Purpose: ",{"$f":"IF('Loan Calculator'!N8=\"\",\"Not stated\",'Loan Calculator'!N8)","v":"Not stated"}]
[null,"Loan Term:",{"$f":"'Loan Calculator'!F29&IF('Loan Calculator'!F29=1,\" month\",\" months \")","v":"12 months "}]
[null,{"$f":"IF(LEFT('Loan Calculator'!D17,5)=\"fixed\",\"Monthly / Annual Interest Rate (fixed for term):\",\"Monthly / Annual Interest Rate (variable):\")","v":"Monthly / Annual Interest Rate (fixed for term):"},{"$f":"'Loan Calculator'!F31","v":"No Plan"}]
[null,"Net Loan:",{"$f":"'Loan Calculator'!F21","v":350000}]
[null,"Gross Loan: ",{"$f":"'Loan Calculator'!K19","v":361499}]
[null,"Where detailed below, fees are included in the gross loan amount and will be deducted from the advance on completion."]
[null,"Repayment Method:  ",{"$f":"'Loan Calculator'!F33","v":"Rolled"}]
[null,{"$f":"IF('Loan Calculator'!F33=\"rolled\",\"Rolled Interest (Approximate):\", \"Monthly Interest\")","v":"Rolled Interest (Approximate):"},{"$f":"IF('Loan Calculator'!F33=\"rolled\",'Loan Calculator'!K23, 'Loan Calculator'!K21)","v":46332}]
[null,{"$f":"IF('Loan Calculator'!F33=\"rolled\",\"\", \"Monthly serviced interest payments will cover interest only, the full capital balance will not be reduced throughout the term. \")","v":""}]
{"$rows_left_out":66}
{"sheet":"Aff. Calculator","index":3,"n_rows":138,"n_cols":34,"rows_kept":138,"cut":false,"hidden":false,"merged":[[48,23,48,24],[18,33,18,34],[34,28,34,31],[38,28,38,31],[22,14,22,15],[36,19,37,23],[36,24,37,25],[38,33,38,34],[22,33,22,34],[36,33,36,34],[34,33,34,34],[22,19,28,25],[30,24,30,25],[34,24,34,25],[32,24,32,25],[36,28,36,31],[14,19,14,25],[14,10,14,16],[14,28,14,34],[2,14,2,19],[20,33,20,34],[6,1,9,20],[6,27,6,33],[8,27,8,33],[10,27,10,29],[18,24,18,25],[2,1,2,8],[10,1,11,17],[14,1,14,7],[24,28,32,34],[46,9,46,12],[47,9,47,12],[47,13,47,15],[16,24,16,25],[16,10,18,16],[45,23,45,24],[46,23,46,24],[47,23,47,24],[24,10,26,16],[28,14,28,15],[31,9,33,17],[34,9,34,17],[16,33,16,34],[41,1,42,7],[43,9,43,12],[44,9,44,12],[44,13,44,15],[20,24,20,25],[16,1,20,7],[20,14,20,15],[37,1,39,7],[36,1,36,7]]}
[]
[null,"MERCANTILE TRUST BRIDGING AFFORDABILITY MODEL"]
[null,{"$f":"'Loan Calculator'!C5","v":"Effective from 12th June 2025"}]
[]
[null,"Step 1 - Instructions",null,null,null,null,null,null,null,null,null,null,null,null,null,null,null,null,null,null,null,null,null,"Step 2 - Applicant Details"]
[]
[null,"To allow accurate an Affordability Decision to be made, it is essential that ALL cells highlighted in light blue are completed in FULL, across Steps 2 to 5. Once these cells have all been accurately completed, a decision will be returned in the 'Affordability Decision' box. To proceed with the application there must be an outcome of Pass.",null,null,null,null,null,null,null,null,null,null,null,null,null,null,null,null,null,null,null,null,null,null,null,null,"Applicant 1 Name"]
[]
[null,null,null,null,null,null,null,null,null,null,null,null,null,null,null,null,null,null,null,null,null,null,null,null,null,null,"Applicant 2 Name"]
[]
[null,null,null,null,null,null,null,null,null,null,null,null,null,null,null,null,null,null,null,null,null,null,null,null,null,null,"Postcode"]
[]
[]
[]
[null,"Step 3 - Household Size",null,null,null,null,null,null,null,null,"Step 4 - Monthly Income",null,null,null,null,null,null,null,null,"Step 5 - Expenditure",null,null,null,null,null,null,null,null,"AFFORDABILITY DECISION"]
[]
[null,"In this section please enter the relevant number of Adults/Dependants living in the property. Any Dependants aged 18 or over should be classed as an Adults.",null,null,null,null,null,null,null,null,"Please enter the Applicant(s) GUARANTEED income on a 'NET' monthly basis.",null,null,null,null,null,null,null,null,null,null,null,"Residential Mortgage(s) Bal","£",null,null,null,null,null,null,null,"Total resi and new","£",{"$f":"IFERROR(IF(Workings!B34=1,'Loan Calculator'!K23+'Loan Calculator'!F57,0),0)","v":0}]
[]
[null,null,null,null,null,null,null,null,null,null,null,null,null,null,null,null,null,null,null,null,null,null,"Residential Mortgage(s)/Rent Pmt","£",null,null,null,null,null,null,null,"Total Outgoings","£",{"$f":"IFERROR(IF(Workings!B34<>1,(Y19+Y21+Y37),Y37+AH17),\"\")","v":0}]
[]
[null,null,null,null,null,null,null,null,null,null,null,null,null,"Applicant 1 - £",5000,null,null,null,null,null,null,null,"BTL Loan shortfall","£",{"$f":"IFERROR(IF(D47>=0,\"0.00\",D48),0)","v":0},null,null,null,null,null,null,"Total Net Income","£",{"$f":"N45","v":5000}]
[]
[null,null,null,null,null,"Number of Adults   ",1,null,null,null,null,null,null,"Applicant 2 - £",null,null,null,null,null,"In the section below please provide details on the monthly outgoings that will not be cleared with the proceeds of this loan. Please note that no further details are required on expenditures other than those listed below.",null,null,null,null,null,null,null,null,null,null,null,"Outcome",null,{"$f":"X58","v":"TBC"}]
[]
[null,null,null,null,null,"Number of Dependants   ",0,null,null,null,"Please enter the gross annual income for the entire household",null,null,null,null,null,null,null,null,null,null,null,null,null,null,null,null,null,{"$f":"IF(W58=99,H117,IF(W58=0,H114,IF(W58=1,H116,IF(W58=2,H115))))","v":"Applicant's Household income (gross and net) must be entered for a successful affordability decision to be made."}]
[]
[null,null,null,null,null,{"$f":"IF(OR(H83=0,H83=99),\" \",IF(OR(H83=1,H83=2,H83=3,H83=4,H83=5),\"Age in years of Dependant 1   \",\" \"))","v":" "}]
[]
[null,null,null,null,null,{"$f":"IF(OR(H83=0,H83=99),\" \",IF(OR(H83=2,H83=3,H83=4,H83=5),\"Age in years of Dependant 2   \",\" \"))","v":" "},null,null,null,null,null,null,null,"GROSS ANNUAL Income - £"]
[]
{"$rows_left_out":109}
{"sheet":"Summary Matrix","index":4,"n_rows":12,"n_cols":9,"rows_kept":12,"cut":false,"hidden":true,"merged":[[1,7,1,8]]}
[]
[null,null,null,null,null,null,null,"Rate (Monthly)"]
[null,"Plan Matrix",null,null,"Min Loan","Max Loan","Max LTV","Variable","Fixed for Term"]
[null,"First Charge 0 SP",null,null,25000,500000,0.75,9.9000000000000008E-3,1.01E-2]
[null,"First Charge 1 SP",null,null,25000,500000,0.7,1.01E-2,1.03E-2]
[null,"First Charge 2 SP",null,null,25000,250000,0.65,1.03E-2,1.0500000000000001E-2]
[null,"Second Charge 0 SP",null,null,25000,300000,0.75,1.01E-2,1.03E-2]
[null,"Second Charge 1 SP",null,null,25000,250000,0.7,1.03E-2,1.0500000000000001E-2]
[null,"Second Charge 2 SP",null,null,25000,100000,0.65,1.0500000000000001E-2,1.0699999999999999E-2]
[]
[null,"For full details please see our Broker Portal"]
[null,"https://www.mercantiletrust.co.uk/intermediary-portal/Account/Login"]

{"sheet":"ONS Figures","index":5,"n_rows":33,"n_cols":21,"rows_kept":33,"cut":false,"hidden":true,"merged":[]}
["Updated 04.2025"]
[]
["Multiple","Factor",null,"Quintile",1,2,3,4,5,null,null,"from (y)","From (m)"]
["1st adult",1,null,"a26",1,1,1,1,1,null,1,0,null,1]
["Ad adult",0.7,null,"a29",1.7,1.7,1.7,1.7,1.7,null,2,19760,{"$f":"L5/12","v":1646.6666666666667},2]
["Older ch 17-18",0.67,null,"a56",1.8090702947845807,2.1695473251028807,2.3509539842873179,2.4627822944896116,2.5488372093023255,null,3,32604,{"$f":"L6/12","v":2717},3]
["young ch 0-16",0.33,null,null,null,null,null,null,null,null,4,48516,4043,4]
["Buffer",150,null,null,null,null,null,null,null,null,5,73008,6084,5]
[]
["Monthly 1st adult",null,"Pasted Values"]
[null,null,"Q1",null,null,null,"Q2",null,null,null,"Q3",null,null,null,"Q4",null,null,null,"Q5"]
[null,null,{"$f":"C11&C13","v":"Q1A26"},{"$f":"C11&D13","v":"Q1A29"},{"$f":"C11&E13","v":"Q1A56"},null,{"$f":"G11&G13","v":"Q2A26"},{"$f":"G11&H13","v":"Q2A29"},{"$f":"G11&I13","v":"Q2A56"},null,{"$f":"K11&K13","v":"Q3A26"},{"$f":"K11&L13","v":"Q3A29"},{"$f":"K11&M13","v":"Q3A56"},null,{"$f":"O11&O13","v":"Q4A26"},{"$f":"O11&P13","v":"Q4A29"},{"$f":"O11&Q13","v":"Q4A56"},null,{"$f":"S11&S13","v":"Q5A26"},{"$f":"S11&T13","v":"Q5A29"},{"$f":"S11&U13","v":"Q5A56"}]
[null,null,"A26","A29","A56",null,"A26","A29","A56",null,"A26","A29","A56",null,"A26","A29","A56",null,"A26","A29","A56"]
[]
[]
[]
[]
[]
[]
[]
[]
[]
[]
[]
[]
[]
[]
[]
[]
[]
{"$rows_left_out":3}